Monthly Archives: August 2013

openssl.c:182: error: expected specifier-qualifier-list before ‘LHASH’

‘make’ command gave me the following error while trying to compile php 4.4.9 in a RHEL6 server. /usr/src/php-4.4.9/ext/openssl/openssl.c:182: error: expected… Continue reading »

make: *** [ext/dom/node.lo] Error 1

Got the following error while running make command in a custom php-5.3 installation in a server. /usr/src/php-5.3.10/ext/dom/node.c: In function ‘dom_canonicalization’:… Continue reading »